Reaction Details
TargetKrueppel-like factor 5
LigandBDBM70218
Substrate/Competitorn/a
Meas. Tech.Late stage results from the probe development effort to identify inhibitors of kruppel-like factor 5 (KLF5): luminescence-based cell-based dose response assay for inhibitors of KLF5 (Round 1)
IC50 267.46±n/a nM
Citation PubChem, PC Late stage results from the probe development effort to identify inhibitors of kruppel-like factor 5 (KLF5): luminescence-based cell-based dose response assay for inhibitors of KLF5 (Round 1) PubChem Bioassay(2010)[AID]
 
Krueppel-like factor 5
Name:Krueppel-like factor 5
Type:Enzyme Catalytic Domain
Mol. Mass.:50808.71
Organism:Homo sapiens (Human)
Description:Q13887
Residue:457
BDBM70218
NameBDBM70218
Synonyms:3-[3-(4-tert-butylphenyl)-1,2,4-oxadiazol-5-yl]-N-(6-morpholin-4-ylpyridin-3-yl)propanamide 3-[3-(4-tert-butylphenyl)-1,2,4-oxadiazol-5-yl]-N-[6-(4-morpholinyl)-3-pyridinyl]propanamide SR-03000001346-1 | cid_45281179
TypeSmall organic molecule
Emp. Form.C24H29N5O3
Mol. Mass.435.5188
SMILESCC(C)(C)c1ccc(cc1)-c1noc(CCC(=O)Nc2ccc(nc2)N2CCOCC2)n1