Reaction Details
TargetEstrogen receptor
LigandBDBM269357
Substrate/Competitorn/a
Meas. Tech.ERalpha Degradation (MCF7 Cells)
pH7.4±n/a
Temperature298.15±n/a K
IC50 1.000±n/a nM
Commentsextracted
Citation Burks, HEDechantsreiter, MAHe, GNunez, JPeukert, SSpringer, CSun, YThomsen, NMTria, GSYu, B Benzothiophene derivatives and compositions thereof as selective estrogen receptor degraders US Patent US10058534 Publication Date 8/28/2018
 
Estrogen receptor
Name:Estrogen receptor
Type:Protein
Mol. Mass.:66230.44
Organism:Homo sapiens (Human)
Description:P03372
Residue:595
BDBM269357
NameBDBM269357
Synonyms:(E)-3-(4-((2-(2,4- bis(trifluoromethyl) phenyl)-6-hydroxy- benzo[b]thiophen-3- yl)oxy)phenyl)-acrylic acid | US10058534, 11
TypeSmall organic molecule
Emp. Form.C25H14F6O4S
Mol. Mass.524.432
SMILESOC(=O)\C=C\c1ccc(Oc2c(sc3cc(O)ccc23)-c2ccc(cc2C(F)(F)F)C(F)(F)F)cc1