Reaction Details
TargetEstrogen receptor
LigandBDBM269424
Substrate/Competitorn/a
Meas. Tech.ERalpha Degradation (MCF7 Cells)
pH7.4±n/a
Temperature298.15±n/a K
IC50 4.20±n/a nM
Commentsextracted
Citation Burks, HEDechantsreiter, MAHe, GNunez, JPeukert, SSpringer, CSun, YThomsen, NMTria, GSYu, B Benzothiophene derivatives and compositions thereof as selective estrogen receptor degraders US Patent US10058534 Publication Date 8/28/2018
 
Estrogen receptor
Name:Estrogen receptor
Type:Protein
Mol. Mass.:66230.44
Organism:Homo sapiens (Human)
Description:P03372
Residue:595
BDBM269424
NameBDBM269424
Synonyms:US10058534, 79
TypeSmall organic molecule
Emp. Form.C24H16F2O4S
Mol. Mass.438.443
SMILESOC(=O)\C=C\c1ccc(Oc2c(sc3cc(O)ccc23)-c2ccccc2C(F)F)cc1