Reaction Details
TargetEstrogen receptor
LigandBDBM269447
Substrate/Competitorn/a
Meas. Tech.ER Transcription Assay (MCF7 Cells)
pH5.1±n/a
Temperature310.15±n/a K
IC50 1.20±n/a nM
Commentsextracted
Citation Burks, HEDechantsreiter, MAHe, GNunez, JPeukert, SSpringer, CSun, YThomsen, NMTria, GSYu, B Benzothiophene derivatives and compositions thereof as selective estrogen receptor degraders US Patent US10058534 Publication Date 8/28/2018
 
Estrogen receptor
Name:Estrogen receptor
Type:Protein
Mol. Mass.:66230.44
Organism:Homo sapiens (Human)
Description:P03372
Residue:595
BDBM269447
NameBDBM269447
Synonyms:(E)-2-(2- isopropylphenyl)-3-(4- (2-(5-methyl-1,3,4- oxadiazol-2- yl)vinyl)phenoxy)benzo [b]thiophen-6-ol | US10058534, 102
TypeSmall organic molecule
Emp. Form.C28H24N2O3S
Mol. Mass.468.567
SMILESCC(C)c1ccccc1-c1sc2cc(O)ccc2c1Oc1ccc(\C=C\c2nnc(C)o2)cc1