Reaction Details
TargetEstrogen receptor
LigandBDBM269452
Substrate/Competitorn/a
Meas. Tech.ERalpha Degradation (MCF7 Cells)
pH7.4±n/a
Temperature298.15±n/a K
IC50 4.00±n/a nM
Commentsextracted
Citation Burks, HEDechantsreiter, MAHe, GNunez, JPeukert, SSpringer, CSun, YThomsen, NMTria, GSYu, B Benzothiophene derivatives and compositions thereof as selective estrogen receptor degraders US Patent US10058534 Publication Date 8/28/2018
 
Estrogen receptor
Name:Estrogen receptor
Type:Protein
Mol. Mass.:66230.44
Organism:Homo sapiens (Human)
Description:P03372
Residue:595
BDBM269452
NameBDBM269452
Synonyms:(E)-2-(2- isopropylphenyl)-3-(4- (2-(5-propyl-4H-1,2,4- triazol-3- yl)vinyl)phenoxy)benzo [b]thiophen-6-ol | US10058534, 107
TypeSmall organic molecule
Emp. Form.C30H29N3O2S
Mol. Mass.495.635
SMILESCCCc1nnc(\C=C\c2ccc(Oc3c(sc4cc(O)ccc34)-c3ccccc3C(C)C)cc2)[nH]1