Reaction Details
TargetEstrogen receptor
LigandBDBM269469
Substrate/Competitorn/a
Meas. Tech.ERalpha Degradation (MCF7 Cells)
pH7.4±n/a
Temperature298.15±n/a K
IC50 1.40±n/a nM
Commentsextracted
Citation Burks, HEDechantsreiter, MAHe, GNunez, JPeukert, SSpringer, CSun, YThomsen, NMTria, GSYu, B Benzothiophene derivatives and compositions thereof as selective estrogen receptor degraders US Patent US10058534 Publication Date 8/28/2018
 
Estrogen receptor
Name:Estrogen receptor
Type:Protein
Mol. Mass.:66230.44
Organism:Homo sapiens (Human)
Description:P03372
Residue:595
BDBM269469
NameBDBM269469
Synonyms:(E)-3-(4-((6-hydroxy-2- (2-isopropyl-6- methylphenyl)benzo[b] thiophen-3- yl)oxy)phenyl)acrylic acid | US10058534, 124
TypeSmall organic molecule
Emp. Form.C27H24O4S
Mol. Mass.444.542
SMILESCC(C)c1cccc(C)c1-c1sc2cc(O)ccc2c1Oc1ccc(\C=C\C(O)=O)cc1