Reaction Details
TargetIsoform 2 of Nuclear receptor corepressor 2 (TRAC-1)
LigandBDBM75969
Substrate/Competitorn/a
Meas. Tech.Counterscreen for NR2E3 inverse agonists
IC50 1775±n/a nM
Citation PubChem, PC Counterscreen for NR2E3 inverse agonists: TR-FRET-based biochemical high throughput dose response assay to identify inverse agonists of the interaction between peroxisome proliferator-activated receptor gamma (PPARg) and nuclear receptor co-repressor 2 (NCOR2) PubChem Bioassay(2010)[AID]
 
Isoform 2 of Nuclear receptor corepressor 2 (TRAC-1)
Name:Isoform 2 of Nuclear receptor corepressor 2 (TRAC-1)
Type:Enzyme Catalytic Domain
Mol. Mass.:81401.89
Organism:Homo sapiens (Human)
Description:Q9Y618-2 gi_116256445
Residue:766
BDBM75969
NameBDBM75969
Synonyms:MLS000536380 N-(3-chlorophenyl)-4-(3-methyl-4-oxo-1-phthalazinyl)benzamide N-(3-chlorophenyl)-4-(3-methyl-4-oxophthalazin-1-yl)benzamide SMR000143417 | cid_1292429
TypeSmall organic molecule
Emp. Form.C22H16ClN3O2
Mol. Mass.389.834
SMILESCn1nc(-c2ccc(cc2)C(=O)Nc2cccc(Cl)c2)c2ccccc2c1=O