Reaction Details
TargetIsoform 2 of Nuclear receptor corepressor 2 (TRAC-1)
LigandBDBM76009
Substrate/Competitorn/a
Meas. Tech.Counterscreen for NR2E3 inverse agonists
IC50 941±n/a nM
Citation PubChem, PC Counterscreen for NR2E3 inverse agonists: TR-FRET-based biochemical high throughput dose response assay to identify inverse agonists of the interaction between peroxisome proliferator-activated receptor gamma (PPARg) and nuclear receptor co-repressor 2 (NCOR2) PubChem Bioassay(2010)[AID]
 
Isoform 2 of Nuclear receptor corepressor 2 (TRAC-1)
Name:Isoform 2 of Nuclear receptor corepressor 2 (TRAC-1)
Type:Enzyme Catalytic Domain
Mol. Mass.:81401.89
Organism:Homo sapiens (Human)
Description:Q9Y618-2 gi_116256445
Residue:766
BDBM76009
NameBDBM76009
Synonyms:3-(3,4-dimethoxyphenyl)-N-[2-[(4-fluorobenzyl)amino]-2-keto-ethyl]-4-keto-phthalazine-1-carboxamide 3-(3,4-dimethoxyphenyl)-N-[2-[(4-fluorophenyl)methylamino]-2-oxoethyl]-4-oxo-1-phthalazinecarboxamide MLS000936274 cid_22334119
TypeSmall organic molecule
Emp. Form.C26H23FN4O5
Mol. Mass.490.483
SMILESCOc1ccc(cc1OC)-n1nc(C(=O)NCC(=O)NCc2ccc(F)cc2)c2ccccc2c1=O