Reaction Details
TargetLysine-specific histone demethylase 1A
LigandBDBM270488
Substrate/Competitorn/a
Meas. Tech.LSD1 enzymatic assay
pH7.5±n/a
Temperature298.15±n/a K
IC50 9.00±n/a nM
Commentsextracted
Citation Vaisburg, AMarx, MA LSD1 inhibitors US Patent US10059668 Publication Date 8/28/2018
 
Lysine-specific histone demethylase 1A
Name:Lysine-specific histone demethylase 1A
Type:Enzyme
Mol. Mass.:92901.01
Organism:Homo sapiens (Human)
Description:O60341
Residue:852
BDBM270488
NameBDBM270488
Synonyms:US10059668, Example 52
TypeSmall organic molecule
Emp. Form.C27H35N3O3S
Mol. Mass.481.65
SMILESCN(C(=O)\C=C\c1ccc(CN2CCC(CN[C@@H]3C[C@H]3c3ccccc3)CC2)cc1)S(C)(=O)=O