Reaction Details
TargetDNA (cytosine-5)-methyltransferase 3A
LigandBDBM46240
Substrate/Competitorn/a
Meas. Tech.SAR Selectivity Analysis of small molecule inhibitors of PEST using pCAP in a fluorescence assay
IC50 7560±n/a nM
Citation PubChem, PC SAR Selectivity Analysis of small molecule inhibitors of PEST using pCAP in a fluorescence assay PubChem Bioassay(2010)[AID]
 
DNA (cytosine-5)-methyltransferase 3A
Name:DNA (cytosine-5)-methyltransferase 3A
Type:PROTEIN
Mol. Mass.:101857.24
Organism:Homo sapiens (Human)
Description:ChEMBL_1510405
Residue:912
BDBM46240
NameBDBM46240
Synonyms:4-[(E)-2-[3-bromanyl-4-[(4-fluorophenyl)methoxy]phenyl]-1-cyano-ethenyl]benzoic acid 4-[(E)-2-[3-bromo-4-[(4-fluorophenyl)methoxy]phenyl]-1-cyanoethenyl]benzoic acid cid_2240797
TypeSmall organic molecule
Emp. Form.C23H15BrFNO3
Mol. Mass.452.273
SMILESOC(=O)c1ccc(cc1)C(=C/c1ccc(OCc2ccc(F)cc2)c(Br)c1)\C#N