Reaction Details
TargetDNA (cytosine-5)-methyltransferase 3A
LigandBDBM46267
Substrate/Competitorn/a
Meas. Tech.SAR Selectivity Analysis of small molecule inhibitors of PEST using pCAP in a fluorescence assay
IC50 2200±n/a nM
Citation PubChem, PC SAR Selectivity Analysis of small molecule inhibitors of PEST using pCAP in a fluorescence assay PubChem Bioassay(2010)[AID]
 
DNA (cytosine-5)-methyltransferase 3A
Name:DNA (cytosine-5)-methyltransferase 3A
Type:PROTEIN
Mol. Mass.:101857.24
Organism:Homo sapiens (Human)
Description:ChEMBL_1510405
Residue:912
BDBM46267
NameBDBM46267
Synonyms:2-[2-chloranyl-6-methoxy-4-[(Z)-[3-[2-[(3-methylphenyl)amino]-2-oxidanylidene-ethyl]-2,4-bis(oxidanylidene)-1,3-thiazolidin-5-ylidene]methyl]phenoxy]ethanoic acid 2-[2-chloro-6-methoxy-4-[(Z)-[3-[2-(3-methylanilino)-2-oxoethyl]-2,4-dioxo-1,3-thiazolidin-5-ylidene]methyl]phenoxy]acetic acid MLS-0425580.0001 | cid_2260301
TypeSmall organic molecule
Emp. Form.C22H19ClN2O7S
Mol. Mass.490.913
SMILESCOc1cc(\C=C2/SC(=O)N(CC(=O)Nc3cccc(C)c3)C2=O)cc(Cl)c1OCC(O)=O