Reaction Details
TargetDNA (cytosine-5)-methyltransferase 3A
LigandBDBM48802
Substrate/Competitorn/a
Meas. Tech.SAR Selectivity Analysis of small molecule inhibitors of PEST using pCAP in a fluorescence assay
IC50 1000±n/a nM
Citation PubChem, PC SAR Selectivity Analysis of small molecule inhibitors of PEST using pCAP in a fluorescence assay PubChem Bioassay(2010)[AID]
 
DNA (cytosine-5)-methyltransferase 3A
Name:DNA (cytosine-5)-methyltransferase 3A
Type:PROTEIN
Mol. Mass.:101857.24
Organism:Homo sapiens (Human)
Description:ChEMBL_1510405
Residue:912
BDBM48802
NameBDBM48802
Synonyms:2-[2-ethoxy-4-[[[4-[2-(4-methylanilino)-1,3-thiazol-4-yl]benzoyl]hydrazinylidene]methyl]phenoxy]acetic acid 2-[2-ethoxy-4-[[[4-[2-[(4-methylphenyl)amino]-1,3-thiazol-4-yl]phenyl]carbonylhydrazinylidene]methyl]phenoxy]ethanoic acid MLS000713540 cid_3143475
TypeSmall organic molecule
Emp. Form.C28H26N4O5S
Mol. Mass.530.595
SMILESCCOc1cc(C=NNC(=O)c2ccc(cc2)-c2csc(Nc3ccc(C)cc3)n2)ccc1OCC(O)=O