Reaction Details
TargetDNA (cytosine-5)-methyltransferase 3A
LigandBDBM61650
Substrate/Competitorn/a
Meas. Tech.SAR Selectivity Analysis of small molecule inhibitors of PEST using pCAP in a fluorescence assay
IC50 12100±n/a nM
Citation PubChem, PC SAR Selectivity Analysis of small molecule inhibitors of PEST using pCAP in a fluorescence assay PubChem Bioassay(2010)[AID]
 
DNA (cytosine-5)-methyltransferase 3A
Name:DNA (cytosine-5)-methyltransferase 3A
Type:PROTEIN
Mol. Mass.:101857.24
Organism:Homo sapiens (Human)
Description:ChEMBL_1510405
Residue:912
BDBM61650
NameBDBM61650
Synonyms:4-[4-[(5Z)-4-keto-5-piperonylidene-2-thioxo-thiazolidin-3-yl]butanoylamino]benzoic acid 4-[4-[(5Z)-5-(1,3-benzodioxol-5-ylmethylidene)-4-oxo-2-sulfanylidene-1,3-thiazolidin-3-yl]butanoylamino]benzoic acid MLS001083039 cid_2269231
TypeSmall organic molecule
Emp. Form.C22H18N2O6S2
Mol. Mass.470.518
SMILESOC(=O)c1ccc(NC(=O)CCCN2C(=S)S\C(=C/c3ccc4OCOc4c3)C2=O)cc1