Reaction Details
TargetRecBCD enzyme subunit RecD
LigandBDBM77550
Substrate/Competitorn/a
Meas. Tech.Counterscreen for AddAB inhibitors: absorbance-based bacterial cell-based high throughput dose response assay to identify inhibitors of RecBCD
IC50>39537±n/a nM
Citation PubChem, PC Counterscreen for AddAB inhibitors: absorbance-based bacterial cell-based high throughput dose response assay to identify inhibitors of RecBCD PubChem Bioassay(2010)[AID]
 
RecBCD enzyme subunit RecD
Name:RecBCD enzyme subunit RecD
Type:Enzyme Catalytic Domain
Mol. Mass.:66906.68
Organism:Escherichia coli str. K-12 substr. MG1655
Description:gi_16130723
Residue:608
BDBM77550
NameBDBM77550
Synonyms:(2E)-1-ethyl-6-methyl-2-[(1-prop-2-enyl-2-quinolin-1-iumyl)methylidene]quinoline;bromide (2E)-2-[(1-allylquinolin-1-ium-2-yl)methylene]-1-ethyl-6-methyl-quinoline;bromide MLS000727846 cid_16193032
TypeSmall organic molecule
Emp. Form.C25H25N2
Mol. Mass.353.4789
SMILESCCN1\C(=C\c2ccc3ccccc3[n+]2CC=C)C=Cc2cc(C)ccc12