Reaction Details
TargetRecBCD enzyme subunit RecD
LigandBDBM77571
Substrate/Competitorn/a
Meas. Tech.Counterscreen for AddAB inhibitors: absorbance-based bacterial cell-based high throughput dose response assay to identify inhibitors of RecBCD
IC50>39487±n/a nM
Citation PubChem, PC Counterscreen for AddAB inhibitors: absorbance-based bacterial cell-based high throughput dose response assay to identify inhibitors of RecBCD PubChem Bioassay(2010)[AID]
 
RecBCD enzyme subunit RecD
Name:RecBCD enzyme subunit RecD
Type:Enzyme Catalytic Domain
Mol. Mass.:66906.68
Organism:Escherichia coli str. K-12 substr. MG1655
Description:gi_16130723
Residue:608
BDBM77571
NameBDBM77571
Synonyms:(3-chloro-4-fluoro-phenyl)-[5-(trifluoromethyl)-1,3,4-thiadiazol-2-yl]amine N-(3-chloranyl-4-fluoranyl-phenyl)-5-(trifluoromethyl)-1,3,4-thiadiazol-2-amine SMR000460334 | cid_2729976
TypeSmall organic molecule
Emp. Form.C9H4ClF4N3S
Mol. Mass.297.66
SMILESFc1ccc(Nc2nnc(s2)C(F)(F)F)cc1Cl