Reaction Details
TargetRecBCD enzyme subunit RecD
LigandBDBM75309
Substrate/Competitorn/a
Meas. Tech.Counterscreen for AddAB inhibitors: absorbance-based bacterial cell-based high throughput dose response assay to identify inhibitors of RecBCD
IC50 80908±n/a nM
Citation PubChem, PC Counterscreen for AddAB inhibitors: absorbance-based bacterial cell-based high throughput dose response assay to identify inhibitors of RecBCD PubChem Bioassay(2010)[AID]
 
RecBCD enzyme subunit RecD
Name:RecBCD enzyme subunit RecD
Type:Enzyme Catalytic Domain
Mol. Mass.:66906.68
Organism:Escherichia coli str. K-12 substr. MG1655
Description:gi_16130723
Residue:608
BDBM75309
NameBDBM75309
Synonyms:(2Z)-3-ethyl-2-[(E)-3-(3-ethyl-1,3-benzothiazol-3-ium-2-yl)prop-2-enylidene]-1,3-benzothiazole;iodide MLS001032120 cid_5709759
TypeSmall organic molecule
Emp. Form.C21H21N2S2
Mol. Mass.365.534
SMILESCCN1\C(Sc2ccccc12)=C\C=C\c1sc2ccccc2[n+]1CC