Reaction Details
TargetDNA dC->dU-editing enzyme APOBEC-3G
LigandBDBM34523
Substrate/Competitorn/a
Meas. Tech.Dose Response confirmation of small molecule APOBEC3G DNA Deaminase Inhibitors via a fluorescence-based single-stranded DNA deaminase assay
Temperature298.15±n/a K
IC50 2180±n/a nM
Commentsextracted
Citation PubChem, PC Dose Response confirmation of small molecule APOBEC3G DNA Deaminase Inhibitors via a fluorescence-based single-stranded DNA deaminase assay PubChem Bioassay(2011)[AID]
 
DNA dC->dU-editing enzyme APOBEC-3G
Name:DNA dC->dU-editing enzyme APOBEC-3G
Type:Enzyme Catalytic Domain
Mol. Mass.:46419.54
Organism:Homo sapiens (Human)
Description:gi_13399304
Residue:384
BDBM34523
NameBDBM34523
Synonyms:8-(2-chlorophenyl)-3-(4-ethoxyphenyl)-6-oxidanylidene-2,4,7,8-tetrahydropyrido[2,1-b][1,3,5]thiadiazine-9-carbonitrile 8-(2-chlorophenyl)-6-keto-3-p-phenetyl-2,4,7,8-tetrahydropyrido[2,1-b][1,3,5]thiadiazine-9-carbonitrile SMR000094225 | cid_5309663
TypeSmall organic molecule
Emp. Form.C22H20ClN3O2S
Mol. Mass.425.931
SMILESCCOc1ccc(cc1)N1CSC2=C(C#N)C(CC(=O)N2C1)c1ccccc1Cl