Reaction Details
TargetDNA dC->dU-editing enzyme APOBEC-3G
LigandBDBM47719
Substrate/Competitorn/a
Meas. Tech.Dose Response confirmation of small molecule APOBEC3G DNA Deaminase Inhibitors via a fluorescence-based single-stranded DNA deaminase assay
Temperature298.15±n/a K
IC50 11900±n/a nM
Commentsextracted
Citation PubChem, PC Dose Response confirmation of small molecule APOBEC3G DNA Deaminase Inhibitors via a fluorescence-based single-stranded DNA deaminase assay PubChem Bioassay(2011)[AID]
 
DNA dC->dU-editing enzyme APOBEC-3G
Name:DNA dC->dU-editing enzyme APOBEC-3G
Type:Enzyme Catalytic Domain
Mol. Mass.:46419.54
Organism:Homo sapiens (Human)
Description:gi_13399304
Residue:384
BDBM47719
NameBDBM47719
Synonyms:(4-chlorodithiazol-5-ylidene)-(4-chloro-2-methyl-phenyl)amine 4-chloro-N-(4-chloro-2-methylphenyl)-5-dithiazolimine 4-chloro-N-(4-chloro-5H-1,2,3-dithiazol-5-yliden)-2-methylaniline SMR000125448 | cid_1471255
TypeSmall organic molecule
Emp. Form.C9H6Cl2N2S2
Mol. Mass.277.193
SMILESCc1cc(Cl)ccc1\N=c1\ssnc1Cl