Reaction Details
TargetDNA dC->dU-editing enzyme APOBEC-3G
LigandBDBM80142
Substrate/Competitorn/a
Meas. Tech.Dose Response confirmation of small molecule APOBEC3G DNA Deaminase Inhibitors via a fluorescence-based single-stranded DNA deaminase assay
Temperature298.15±n/a K
IC50 1980±n/a nM
Commentsextracted
Citation PubChem, PC Dose Response confirmation of small molecule APOBEC3G DNA Deaminase Inhibitors via a fluorescence-based single-stranded DNA deaminase assay PubChem Bioassay(2011)[AID]
 
DNA dC->dU-editing enzyme APOBEC-3G
Name:DNA dC->dU-editing enzyme APOBEC-3G
Type:Enzyme Catalytic Domain
Mol. Mass.:46419.54
Organism:Homo sapiens (Human)
Description:gi_13399304
Residue:384
BDBM80142
NameBDBM80142
Synonyms:6-Bromo-5-methyl-1H-imidazo[4,5-b]pyridine-2-thiol 6-bromo-5-methyl-1,3-dihydroimidazo[4,5-b]pyridine-2-thione SMR000146758 | cid_5391173
TypeSmall organic molecule
Emp. Form.C7H6BrN3S
Mol. Mass.244.112
SMILESCc1nc2[nH]c(=S)[nH]c2cc1Br