Reaction Details
TargetDNA dC->dU-editing enzyme APOBEC-3G
LigandBDBM54743
Substrate/Competitorn/a
Meas. Tech.Dose Response confirmation of small molecule APOBEC3G DNA Deaminase Inhibitors via a fluorescence-based single-stranded DNA deaminase assay
Temperature298.15±n/a K
IC50 7130±n/a nM
Commentsextracted
Citation PubChem, PC Dose Response confirmation of small molecule APOBEC3G DNA Deaminase Inhibitors via a fluorescence-based single-stranded DNA deaminase assay PubChem Bioassay(2011)[AID]
 
DNA dC->dU-editing enzyme APOBEC-3G
Name:DNA dC->dU-editing enzyme APOBEC-3G
Type:Enzyme Catalytic Domain
Mol. Mass.:46419.54
Organism:Homo sapiens (Human)
Description:gi_13399304
Residue:384
BDBM54743
NameBDBM54743
Synonyms:1-(4-piperidin-1-ylphenyl)pyrrole-2,5-dione 1-[4-(1-piperidinyl)phenyl]pyrrole-2,5-dione SMR000289810 | cid_512832
TypeSmall organic molecule
Emp. Form.C15H16N2O2
Mol. Mass.256.2997
SMILESO=C1C=CC(=O)N1c1ccc(cc1)N1CCCCC1