Reaction Details
TargetDNA dC->dU-editing enzyme APOBEC-3G
LigandBDBM80275
Substrate/Competitorn/a
Meas. Tech.Dose Response confirmation of small molecule APOBEC3G DNA Deaminase Inhibitors via a fluorescence-based single-stranded DNA deaminase assay
Temperature298.15±n/a K
IC50 2100±n/a nM
Commentsextracted
Citation PubChem, PC Dose Response confirmation of small molecule APOBEC3G DNA Deaminase Inhibitors via a fluorescence-based single-stranded DNA deaminase assay PubChem Bioassay(2011)[AID]
 
DNA dC->dU-editing enzyme APOBEC-3G
Name:DNA dC->dU-editing enzyme APOBEC-3G
Type:Enzyme Catalytic Domain
Mol. Mass.:46419.54
Organism:Homo sapiens (Human)
Description:gi_13399304
Residue:384
BDBM80275
NameBDBM80275
Synonyms:4-(2-furanylmethylideneamino)-3-(3-methylphenyl)-1H-1,2,4-triazole-5-thione 4-(furan-2-ylmethylideneamino)-3-(3-methylphenyl)-1H-1,2,4-triazole-5-thione MLS000332345 cid_951390
TypeSmall organic molecule
Emp. Form.C14H12N4OS
Mol. Mass.284.336
SMILESCc1cccc(c1)-c1n[nH]c(=S)n1N=Cc1ccco1