Reaction Details
TargetSterol 14-alpha demethylase
LigandBDBM81297
Substrate/Competitorn/a
Meas. Tech.Inhibition Assay
pH6±0
Kd 3.2e+2±n/a nM
Citation Lepesheva, GIOtt, RDHargrove, TYKleshchenko, YYSchuster, INes, WDHill, GCVillalta, FWaterman, MR Sterol 14alpha-demethylase as a potential target for antitrypanosomal therapy: enzyme inhibition and parasite cell growth. Chem Biol14:1283-93 (2007) 
 
Sterol 14-alpha demethylase
Name:Sterol 14-alpha demethylase
Type:Protein
Mol. Mass.:54690.12
Organism:Trypanosoma cruzi
Description:Q7Z1V1
Residue:481
BDBM81297
NameBDBM81297
Synonyms:Azole, 1
TypeSmall organic molecule
Emp. Form.C24H19Cl2N3O
Mol. Mass.436.333
SMILESClc1ccc(cc1)C(CNC(=O)c1ccccc1)(c1ccc(Cl)cc1)n1ccnc1