Reaction Details
TargetSterol 14-alpha demethylase
LigandBDBM81301
Substrate/Competitorn/a
Meas. Tech.Inhibition Assay
pH6±0
Kd 1.3e+2±n/a nM
Citation Lepesheva, GIOtt, RDHargrove, TYKleshchenko, YYSchuster, INes, WDHill, GCVillalta, FWaterman, MR Sterol 14alpha-demethylase as a potential target for antitrypanosomal therapy: enzyme inhibition and parasite cell growth. Chem Biol14:1283-93 (2007) 
 
Sterol 14-alpha demethylase
Name:Sterol 14-alpha demethylase
Type:Protein
Mol. Mass.:54690.12
Organism:Trypanosoma cruzi
Description:Q7Z1V1
Residue:481
BDBM81301
NameBDBM81301
Synonyms:Azole, 6
TypeSmall organic molecule
Emp. Form.C24H19N3O2
Mol. Mass.381.4266
SMILESO=C(NCC(c1ccccc1)n1ccnc1)c1cccc2c3ccccc3oc12