Reaction Details
TargetPutative farnesyl pyrophosphate synthase
LigandBDBM81349
Substrate/Competitorn/a
Meas. Tech.Enzymatic Assay
pH7.7±0
Temperature310.15±0 K
Ki 1.60±0.26 nM
IC50 52.7±7.6 nM
Citation Artz, JDDunford, JEArrowood, MJDong, AChruszcz, MKavanagh, KLMinor, WRussell, RGEbetino, FHOppermann, UHui, R Targeting a uniquely nonspecific prenyl synthase with bisphosphonates to combat cryptosporidiosis. Chem Biol15:1296-306 (2008) 
 
Putative farnesyl pyrophosphate synthase
Name:Putative farnesyl pyrophosphate synthase
Synonyms:n/a
Type:Enzyme
Mol. Mass.:44960.82
Organism:Cryptosporidium parvum
Description:Belongs to the FPP/GGPP synthase family. Q5CR09
Residue:384
BDBM81349
NameBDBM81349
Synonyms:IBAN
TypeSmall organic molecule
Emp. Form.C10H25NO7P2
Mol. Mass.333.2555
SMILESCCCCCN(C)CCCC(O)(P(O)(O)=O)P(O)(O)=O