Reaction Details
TargetDipeptidyl peptidase 1
LigandBDBM81407
Substrate/Competitorn/a
Meas. Tech.Fluorogenic Assay
IC50 186±0.0 nM
Citation Deu, ELeyva, MJAlbrow, VERice, MJEllman, JABogyo, M Functional studies of Plasmodium falciparum dipeptidyl aminopeptidase I using small molecule inhibitors and active site probes. Chem Biol17:808-19 (2010) 
 
Dipeptidyl peptidase 1
Name:Dipeptidyl peptidase 1
Type:PROTEIN
Mol. Mass.:52379.83
Organism:Mus musculus
Description:ChEMBL_44964
Residue:462
BDBM81407
NameBDBM81407
Synonyms:ML4118 ML4118S
TypeSmall organic molecule
Emp. Form.C22H28F4N4O2
Mol. Mass.456.4769
SMILESCCCCC(C(=O)COc1c(F)c(F)cc(F)c1F)n1cc(nn1)C(C)(N)C1CCCC1