Reaction Details
TargetHIV-1 protease
LigandBDBM81679
Substrate/Competitorn/a
Meas. Tech.Inhibition Assay
Ki 0.28±0.0 nM
Citation Chellappan, SKiran Kumar Reddy, GSAli, ANalam, MNAnjum, SGCao, HKairys, VFernandes, MXAltman, MDTidor, BRana, TMSchiffer, CAGilson, MK Design of mutation-resistant HIV protease inhibitors with the substrate envelope hypothesis. Chem Biol Drug Des69:298-313 (2007) 
 
HIV-1 protease
Name:HIV-1 protease
Synonyms:n/a
Type:Protein
Mol. Mass.:10653.94
Organism:Human immunodeficiency virus
Description:O90783
Residue:98
BDBM81679
NameBDBM81679
Synonyms:NFV
TypeSmall organic molecule
Emp. Form.C32H45N3O4S
Mol. Mass.567.782
SMILESCc1c(O)cccc1C(=O)N[C@H](CSc1ccccc1)[C@H](O)CN1CC2CCCCC2C[C@H]1C(=O)NC(C)(C)C