Reaction Details
TargetHIV-1 protease
LigandBDBM578
Substrate/Competitorn/a
Meas. Tech.Inhibition Assay
Ki 0.005±0.0 nM
Citation Chellappan, SKiran Kumar Reddy, GSAli, ANalam, MNAnjum, SGCao, HKairys, VFernandes, MXAltman, MDTidor, BRana, TMSchiffer, CAGilson, MK Design of mutation-resistant HIV protease inhibitors with the substrate envelope hypothesis. Chem Biol Drug Des69:298-313 (2007) 
 
HIV-1 protease
Name:HIV-1 protease
Synonyms:n/a
Type:Protein
Mol. Mass.:10653.94
Organism:Human immunodeficiency virus
Description:O90783
Residue:98
BDBM578
NameBDBM578
TypeSmall organic molecule
Emp. Form.C37H48N4O5
Mol. Mass.628.8008
SMILESCC(C)[C@H](N1CCCNC1=O)C(=O)N[C@H](C[C@H](O)[C@H](Cc1ccccc1)NC(=O)COc1c(C)cccc1C)Cc1ccccc1