Reaction Details
TargetHeat shock protein HSP 90-alpha
LigandBDBM81732
Substrate/Competitorn/a
Meas. Tech.FRET Assay
pH7.5±0
Temperature298.15±0 K
Ki 1.9e+3±n/a nM
Citation Huth, JRPark, CPetros, AMKunzer, ARWendt, MDWang, XLynch, CLMack, JCSwift, KMJudge, RAChen, JRichardson, PLJin, STahir, SKMatayoshi, EDDorwin, SALadror, USSeverin, JMWalter, KABartley, DMFesik, SWElmore, SWHajduk, PJ Discovery and design of novel HSP90 inhibitors using multiple fragment-based design strategies. Chem Biol Drug Des70:1-12 (2007) 
 
Heat shock protein HSP 90-alpha
Name:Heat shock protein HSP 90-alpha
Type:Molecular Chaperone
Mol. Mass.:84623.45
Organism:Homo sapiens (Human)
Description:P07900
Residue:732
BDBM81732
NameBDBM81732
Synonyms:HSP90 Inhibitor, 6
TypeSmall organic molecule
Emp. Form.C17H19N5O4S
Mol. Mass.389.429
SMILESCc1cc(CNS(=O)(=O)c2ccc(NC=C3CCOC3=O)cc2)nc(N)n1