Reaction Details
TargetAdenylate cyclase type 2
LigandBDBM81779
Substrate/Competitorn/a
Ki 9.1±n/a nM
CommentsPDSP_3931
Citation Andersen, PHGrønvald, FCHohlweg, RHansen, LBGuddal, EBraestrup, CNielsen, EB NNC-112, NNC-687 and NNC-756, new selective and highly potent dopamine D1 receptor antagonists. Eur J Pharmacol219:45-52 (1992) 
 
Adenylate cyclase type 2
Name:Adenylate cyclase type 2
Type:PROTEIN
Mol. Mass.:123344.82
Organism:Rattus norvegicus
Description:ChEMBL_305824
Residue:1090
BDBM81779
NameBDBM81779
Synonyms:CAS_164252 NSC_164252
TypeSmall organic molecule
Emp. Form.C19H20N2O4
Mol. Mass.340.3731
SMILESCN1CCc2cc(c(O)cc2C(C1)c1cccc2CCOc12)[N+]([O-])=O