Reaction Details
Target5-hydroxytryptamine 1D receptor
LigandBDBM81780
Substrate/Competitorn/a
Ki>10000±n/a nM
CommentsPDSP_1752
Citation Rinaldi-Carmona, MCongy, CSantucci, VSimiand, JGautret, BNeliat, GLabeeuw, BLe Fur, GSoubrie, PBreliere, JC Biochemical and pharmacological properties of SR 46349B, a new potent and selective 5-hydroxytryptamine2 receptor antagonist. J Pharmacol Exp Ther262:759-68 (1992) 5-hydroxytryptamine 1D receptor
Name:5-hydroxytryptamine 1D receptor
Type:Protein
Mol. Mass.:12731.52
Organism:Bos taurus (Bovine)
Description:Q8MI13
Residue:119
BDBM81780
NameBDBM81780
Synonyms:CAS_6438382 SR 46349B
TypeSmall organic molecule
Emp. Form.C19H21FN2O2
Mol. Mass.328.3806
SMILESCN(C)CCON=C(C=Cc1ccc(O)cc1)c1ccccc1F