Reaction Details
TargetBromodomain-containing protein 4
LigandBDBM106152
Substrate/Competitorn/a
Meas. Tech.Acetyl-Histone Binding Assay
pH7.5±n/a
Temperature298.15±n/a K
IC50 2991±0 nM
Commentsextracted
Citation Bradner, JEGray, NSQi, JMcKeown, MRBuckley, D Diazepane derivatives and uses thereof US Patent US9695172 Publication Date 7/4/2017
 
Bromodomain-containing protein 4
Name:Bromodomain-containing protein 4
Type:Protein
Mol. Mass.:152264.84
Organism:Homo sapiens (Human)
Description:O60885
Residue:1362
BDBM106152
NameBDBM106152
Synonyms:US9695172, 2-221
TypeSmall organic molecule
Emp. Form.C20H19N5O3S
Mol. Mass.409.462
SMILESCN1c2ccccc2C(=O)N(C)c2ccc(Nc3ccc(cc3)S(N)(=O)=O)nc12