Reaction Details
TargetAlpha-2A adrenergic receptor
LigandBDBM81806
Substrate/Competitorn/a
Ki 4.8±n/a nM
CommentsPDSP_1965
Citation Blaxall, HSMurphy, TJBaker, JCRay, CBylund, DB Characterization of the alpha-2C adrenergic receptor subtype in the opossum kidney and in the OK cell line. J Pharmacol Exp Ther259:323-9 (1991) Alpha-2A adrenergic receptor
Name:Alpha-2A adrenergic receptor
Type:Enzyme
Mol. Mass.:48979.91
Organism:Homo sapiens (Human)
Description:P08913
Residue:465
BDBM81806
NameBDBM81806
Synonyms:2-(4,5-dihydro-1h-imidazol-2-yl)-2,3-dihydro-1-(2-propenyl)-1h-indole mono(4-methylbenzenesulfonate) WIN 53782
Typen/a
Emp. Form.C14H15N3
Mol. Mass.225.289
SMILESC=CCn1c(cc2ccccc12)C1=NCCN1