Reaction Details
TargetAlpha-2B adrenergic receptor
LigandBDBM29568
Substrate/Competitorn/a
Ki 5.4±n/a nM
CommentsPDSP_1528
Citation Blaxall, HSMurphy, TJBaker, JCRay, CBylund, DB Characterization of the alpha-2C adrenergic receptor subtype in the opossum kidney and in the OK cell line. J Pharmacol Exp Ther259:323-9 (1991) Alpha-2B adrenergic receptor
Name:Alpha-2B adrenergic receptor
Type:Enzyme Catalytic Domain
Mol. Mass.:50379.83
Organism:NEONATAL RAT
Description:adrenergic Alpha2B ADRA2B NEONATAL RAT::P19328
Residue:453
BDBM29568
NameBDBM29568
Synonyms:CHEMBL2 PRAZOSIN HYDROCHLORIDE [3H]-Minipress [3H]-Prazosin
Typeradiolabeled ligand
Emp. Form.C19H21N5O4
Mol. Mass.383.4011
SMILESCOc1cc2nc(nc(N)c2cc1OC)N1CCN(CC1)C(=O)c1ccco1