Reaction Details
TargetAlpha-2C adrenergic receptor
LigandBDBM81772
Substrate/Competitorn/a
Ki 13±n/a nM
CommentsPDSP_327
Citation Blaxall, HSMurphy, TJBaker, JCRay, CBylund, DB Characterization of the alpha-2C adrenergic receptor subtype in the opossum kidney and in the OK cell line. J Pharmacol Exp Ther259:323-9 (1991) Alpha-2C adrenergic receptor
Name:Alpha-2C adrenergic receptor
Type:Enzyme Catalytic Domain
Mol. Mass.:27257.01
Organism:OK
Description:adrenergic Alpha2C ADRA2C OK::G3GWB4
Residue:230
BDBM81772
NameBDBM81772
Synonyms:ARC-239 NSC_122211
TypeSmall organic molecule
Emp. Form.C25H30N2O3
Mol. Mass.406.5173
SMILESCOc1ccccc1N1CCN(CCC2C(=O)c3ccccc3C(C)(C)C2=O)CC1