Reaction Details
TargetAlpha-2C adrenergic receptor
LigandBDBM35256
Substrate/Competitorn/a
Ki 192±n/a nM
CommentsPDSP_1235
Citation Blaxall, HSMurphy, TJBaker, JCRay, CBylund, DB Characterization of the alpha-2C adrenergic receptor subtype in the opossum kidney and in the OK cell line. J Pharmacol Exp Ther259:323-9 (1991) Alpha-2C adrenergic receptor
Name:Alpha-2C adrenergic receptor
Type:Enzyme Catalytic Domain
Mol. Mass.:53254.77
Organism:OPOSSUM
Description:adrenergic Alpha2C ADRA2C OPOSSUM::P35405
Residue:469
BDBM35256
NameBDBM35256
Synonyms:(S)-mianserin MIANSERIN MIANSERIN (-) | Tolvon
TypeSmall organic molecule
Emp. Form.C18H20N2
Mol. Mass.264.3648
SMILES[H][C@]12CN(C)CCN1c1ccccc1Cc1ccccc21