Reaction Details
TargetAlpha-2C adrenergic receptor
LigandBDBM31046
Substrate/Competitorn/a
Ki 9.7±n/a nM
CommentsPDSP_1479
Citation Blaxall, HSMurphy, TJBaker, JCRay, CBylund, DB Characterization of the alpha-2C adrenergic receptor subtype in the opossum kidney and in the OK cell line. J Pharmacol Exp Ther259:323-9 (1991) Alpha-2C adrenergic receptor
Name:Alpha-2C adrenergic receptor
Type:Enzyme Catalytic Domain
Mol. Mass.:27257.01
Organism:OK
Description:adrenergic Alpha2C ADRA2C OK::G3GWB4
Residue:230
BDBM31046
NameBDBM31046
Synonyms:3-[4,5-dihydro-1H-imidazol-2-ylmethyl-(4-methylphenyl)amino]phenol;methanesulfonic acid 3-[N-(2-imidazolin-2-ylmethyl)-4-methyl-anilino]phenol;mesylic acid MLS000069487 PHENTOLAMINE MESYLATE cid_5775 | cid_91430
TypeSmall organic molecule
Emp. Form.C17H19N3O
Mol. Mass.281.3523
SMILESCc1ccc(cc1)N(CC1=NCCN1)c1cccc(O)c1