Reaction Details
TargetAlpha-2C adrenergic receptor
LigandBDBM81803
Substrate/Competitorn/a
Ki 0.24±n/a nM
CommentsPDSP_1647
Citation Blaxall, HSMurphy, TJBaker, JCRay, CBylund, DB Characterization of the alpha-2C adrenergic receptor subtype in the opossum kidney and in the OK cell line. J Pharmacol Exp Ther259:323-9 (1991) Alpha-2C adrenergic receptor
Name:Alpha-2C adrenergic receptor
Type:Enzyme Catalytic Domain
Mol. Mass.:27257.01
Organism:OK
Description:adrenergic Alpha2C ADRA2C OK::G3GWB4
Residue:230
BDBM81803
NameBDBM81803
Synonyms:CAS_125992 RX 811033
TypeSmall organic molecule
Emp. Form.C13H16N2O3
Mol. Mass.248.2777
SMILESCCOC1(COc2ccccc2O1)C1=NCCN1