Reaction Details
TargetAlpha-2C adrenergic receptor
LigandBDBM81444
Substrate/Competitorn/a
Ki 1.6±n/a nM
CommentsPDSP_1955
Citation Blaxall, HSMurphy, TJBaker, JCRay, CBylund, DB Characterization of the alpha-2C adrenergic receptor subtype in the opossum kidney and in the OK cell line. J Pharmacol Exp Ther259:323-9 (1991) Alpha-2C adrenergic receptor
Name:Alpha-2C adrenergic receptor
Type:Enzyme Catalytic Domain
Mol. Mass.:53254.77
Organism:OPOSSUM
Description:adrenergic Alpha2C ADRA2C OPOSSUM::P35405
Residue:469
BDBM81444
NameBDBM81444
Synonyms:CAS_185453 WB 4101 | WB-4101
TypeSmall organic molecule
Emp. Form.C25H27NO5
Mol. Mass.421.4856
SMILESCOc1cccc(OC)c1OCCNCC1Oc2ccccc2OC1c1ccccc1