Reaction Details
TargetVoltage-dependent calcium channel gamma-1 subunit
LigandBDBM50035057
Substrate/Competitorn/a
Ki>10000±n/a nM
CommentsPDSP_779
Citation Schipper, JTulp, MTSijbesma, H Neurochemical profile of eltoprazine. Drug Metabol Drug Interact8:85-114 (1990) 
 
Voltage-dependent calcium channel gamma-1 subunit
Name:Voltage-dependent calcium channel gamma-1 subunit
Type:Enzyme Catalytic Domain
Mol. Mass.:25030.69
Organism:Homo sapiens (Human)
Description:Calcium channel (DHP) 0 0::Q06432
Residue:222
BDBM50035057
NameBDBM50035057
Synonyms:(eltoprazine)1-(2,3-Dihydro-benzo[1,4]dioxin-5-yl)-piperazine CHEMBL282614 | Eltoprazine
TypeSmall organic molecule
Emp. Form.C12H16N2O2
Mol. Mass.220.2676
SMILESC1CN(CCN1)c1cccc2OCCOc12