Reaction Details
TargetPro-thyrotropin-releasing hormone
LigandBDBM50035057
Substrate/Competitorn/a
Ki>10000±n/a nM
CommentsPDSP_779
Citation Schipper, JTulp, MTSijbesma, H Neurochemical profile of eltoprazine. Drug Metabol Drug Interact8:85-114 (1990) 
 
Pro-thyrotropin-releasing hormone
Name:Pro-thyrotropin-releasing hormone
Type:Enzyme Catalytic Domain
Mol. Mass.:29277.96
Organism:RAT
Description:TRH 0 RAT::P01150
Residue:255
BDBM50035057
NameBDBM50035057
Synonyms:(eltoprazine)1-(2,3-Dihydro-benzo[1,4]dioxin-5-yl)-piperazine CHEMBL282614 | Eltoprazine
TypeSmall organic molecule
Emp. Form.C12H16N2O2
Mol. Mass.220.2676
SMILESC1CN(CCN1)c1cccc2OCCOc12