Reaction Details
TargetAlpha-2C adrenergic receptor
LigandBDBM35256
Substrate/Competitorn/a
Ki 40±n/a nM
CommentsPDSP_1235
Citation Neve, KAHenningsen, RAKinzie, JMDe Paulis, TSchmidt, DEKessler, RMJanowsky, A Sodium-dependent isomerization of dopamine D-2 receptors characterized using [125I]epidepride, a high-affinity substituted benzamide ligand. J Pharmacol Exp Ther252:1108-16 (1990) Alpha-2C adrenergic receptor
Name:Alpha-2C adrenergic receptor
Type:Enzyme Catalytic Domain
Mol. Mass.:49890.50
Organism:RAT
Description:adrenergic Alpha2 0 RAT::P22086
Residue:458
BDBM35256
NameBDBM35256
Synonyms:(S)-mianserin MIANSERIN MIANSERIN (-) | Tolvon
TypeSmall organic molecule
Emp. Form.C18H20N2
Mol. Mass.264.3648
SMILES[H][C@]12CN(C)CCN1c1ccccc1Cc1ccccc21