Reaction Details
TargetPlatelet-activating factor receptor
LigandBDBM50005232
Substrate/Competitorn/a
Ki 1.8±n/a nM
CommentsPDSP_595
Citation Tahraoui, LFloch, ACavero, I Functional validation of platelet-activating factor receptor sites characterized biochemically by a specific and reproducible [3H]platelet-activating factor binding in human platelets. J Pharmacol Exp Ther252:1221-7 (1990) Platelet-activating factor receptor
Name:Platelet-activating factor receptor
Type:Enzyme Catalytic Domain
Mol. Mass.:39219.60
Organism:Homo sapiens (Human)
Description:PAF Platelet activating factor PTAFR HUMAN::P25105
Residue:342
BDBM50005232
NameBDBM50005232
Synonyms:(R)-2-{[Acetyl-(2-methoxy-3-octadecylcarbamoyloxy-propoxycarbonyl)-amino]-methyl}-1-ethyl-pyridinium; chloride 2-{[Acetyl-(2-methoxy-3-octadecylcarbamoyloxy-propoxycarbonyl)-amino]-methyl}-1-ethyl-pyridinium; chloride CHEMBL274420 | CV-6209
TypeSmall organic molecule
Emp. Form.C34H60N3O6
Mol. Mass.606.8562
(=O)OCC(COC(=O)N(Cc1cccc[n+]1CC)C(C)=O)OC