Reaction Details
Targetkappa-type opioid receptor isoform 1
LigandBDBM50000091
Substrate/Competitorn/a
Ki 1.2±n/a nM
CommentsPDSP_776
Citation Benyhe, SVarga, EHepp, JMagyar, ABorsodi, AWollemann, M Characterization of kappa 1 and kappa 2 opioid binding sites in frog (Rana esculenta) brain membrane preparation. Neurochem Res15:899-904 (1990) 
 
kappa-type opioid receptor isoform 1
Name:kappa-type opioid receptor isoform 1
Type:Enzyme Catalytic Domain
Mol. Mass.:44032.90
Organism:Frog
Description:F7A0F2
Residue:392
BDBM50000091
NameBDBM50000091
Synonyms:(6S,11R)-3-Cyclopropylmethyl-6-ethyl-8-hydroxy-11-methyl-3,4,5,6-tetrahydro-2H-2,6-methano-benzo[d]azocin-1-one 3-Cyclopropylmethyl-6-ethyl-8-hydroxy-11-methyl-3,4,5,6-tetrahydro-2H-2,6-methano-benzo[d]azocin-1-one 3-Cyclopropylmethyl-6-ethyl-8-hydroxy-11-methyl-3,4,5,6-tetrahydro-2H-2,6-methano-benzo[d]azocin-1-one(Ethylketazocine, EKC) EKC | EKC(-)
TypeSmall organic molecule
Emp. Form.C19H25NO2
Mol. Mass.299.4073
SMILESCC[C@]12CCN(CC3CC3)C([C@@H]1C)C(=O)c1ccc(O)cc21