Reaction Details
TargetMuscarinic acetylcholine receptor M2
LigandBDBM86231
Substrate/Competitorn/a
Ki 0.28±n/a nM
CommentsPDSP_334
Citation Gies, JPBertrand, CVanderheyden, PWaeldele, FDumont, PPauli, GLandry, Y Characterization of muscarinic receptors in human, guinea pig and rat lung. J Pharmacol Exp Ther250:309-15 (1989) Muscarinic acetylcholine receptor M2
Name:Muscarinic acetylcholine receptor M2
Type:GPCR
Mol. Mass.:51730.61
Organism:Homo sapiens (Human)
Description:P08172
Residue:466
BDBM86231
NameBDBM86231
Synonyms:ATR Atropine,(-) CHEMBL195 US9333195, ATROPINE
TypeSmall organic molecule
Emp. Form.C17H23NO3
Mol. Mass.289.3694
SMILESCN1C2CCC1CC(C2)OC(=O)C(CO)c1ccccc1