Reaction Details
TargetHistamine H3 receptor
LigandBDBM81972
Substrate/Competitorn/a
Ki 52±n/a nM
CommentsPDSP_271
Citation Arrang, JMGarbarg, MLancelot, JCLecomte, JMPollard, HRobba, MSchunack, WSchwartz, JC Highly potent and selective ligands for a new class H3 of histamine receptor. Invest Radiol0:0-2 (1988) 
 
Histamine H3 receptor
Name:Histamine H3 receptor
Type:Enzyme Catalytic Domain
Mol. Mass.:48753.61
Organism:GUINEA PIG
Description:HISTAMINE H3 HRH3 GUINEA PIG::Q9JI35
Residue:445
BDBM81972
NameBDBM81972
Synonyms:(S)-(+)-ALPHA-METHYL-1H-IMIDAZOLE-4-ETHANAMINE DIHYDROBROMIDE CAS_75614-93-6
TypeSmall organic molecule
Emp. Form.C6H11N3
Mol. Mass.125.1716
SMILESC[C@H](N)Cc1cnc[nH]1