Reaction Details
TargetGlutamate receptor ionotropic, NMDA 1
LigandBDBM81977
Substrate/Competitorn/a
Ki 400±n/a nM
CommentsPDSP_618
Citation Murphy, DEHutchison, AJHurt, SDWilliams, MSills, MA Characterization of the binding of [3H]-CGS 19755: a novel N-methyl-D-aspartate antagonist with nanomolar affinity in rat brain. Br J Pharmacol95:932-8 (1988) 
 
Glutamate receptor ionotropic, NMDA 1
Name:Glutamate receptor ionotropic, NMDA 1
Type:Enzyme Catalytic Domain
Mol. Mass.:105533.40
Organism:RAT
Description:P35439
Residue:938
BDBM81977
NameBDBM81977
Synonyms:CAS_79055-68-8 D-AP5 | D-APV
TypeSmall organic molecule
Emp. Form.C5H12NO5P
Mol. Mass.197.1262
SMILESN[C@H](CCCP(O)(O)=O)C(O)=O