Reaction Details
TargetD(1A) dopamine receptor
LigandBDBM81986
Substrate/Competitorn/a
Ki 1.9±n/a nM
CommentsPDSP_3960
Citation Andersen, PH Comparison of the pharmacological characteristics of [3H]raclopride and [3H]SCH 23390 binding to dopamine receptors in vivo in mouse brain. Eur J Pharmacol146:113-20 (1988) 
 
D(1A) dopamine receptor
Name:D(1A) dopamine receptor
Type:Enzyme
Mol. Mass.:49613.93
Organism:Mus musculus (Mouse)
Description:Q61616
Residue:446
BDBM81986
NameBDBM81986
Synonyms:3-Methyl-1-phenyl-2,3,4,5-tetrahydro-1H-benzo[d]azepine-7,8-diol; hydrochloride CHEMBL545000 SKF 75670
TypeSmall organic molecule
Emp. Form.C17H19NO2
Mol. Mass.269.3383
SMILESCN1CCc2cc(O)c(O)cc2C(C1)c1ccccc1