Reaction Details
TargetSodium-dependent dopamine transporter
LigandBDBM50029150
Substrate/Competitorn/a
Ki 1040±n/a nM
CommentsPDSP_976
Citation Shank, RPVaught, JLPelley, KASetler, PEMcComsey, DFMaryanoff, BE McN-5652: a highly potent inhibitor of serotonin uptake. J Pharmacol Exp Ther247:1032-8 (1988) Sodium-dependent dopamine transporter
Name:Sodium-dependent dopamine transporter
Type:Multi-pass membrane protein
Mol. Mass.:68749.45
Organism:Rattus norvegicus (rat)
Description:P23977
Residue:619
BDBM50029150
NameBDBM50029150
Synonyms:3-(2-Piperidin-4-yl-ethyl)-1H-indole Indalpine
TypeSmall organic molecule
Emp. Form.C15H20N2
Mol. Mass.228.3327
SMILESC(Cc1c[nH]c2ccccc12)C1CCNCC1