Reaction Details
TargetHypoxia-inducible factor 1-alpha
LigandBDBM271462
Substrate/Competitorn/a
Meas. Tech.Erythropoietin (EPO) Biological Assay
EC50 1630±n/a nM
Citation Zuo, YWang, XZhang, YWen, LWu, SYuan, X Quinolinone compound and use thereof US Patent US10065928 Publication Date 9/4/2018
 
Hypoxia-inducible factor 1-alpha
Name:Hypoxia-inducible factor 1-alpha
Type:Protein
Mol. Mass.:92647.24
Organism:Homo sapiens (Human)
Description:Q16665
Residue:826
BDBM271462
NameBDBM271462
Synonyms:2-(4-hydroxy-1-methyl-7-(naphthalen-2-yloxy)-2-oxo-1,2-dihydroquinoline-3-carboxamido)acetic acid | US10065928, Example 8
TypeSmall organic molecule
Emp. Form.C23H18N2O6
Mol. Mass.418.3988
SMILESCn1c2cc(Oc3ccc4ccccc4c3)ccc2c(O)c(C(=O)NCC(O)=O)c1=O