Reaction Details
TargetHypoxia-inducible factor 1-alpha
LigandBDBM271481
Substrate/Competitorn/a
Meas. Tech.Erythropoietin (EPO) Biological Assay
EC50 1510±n/a nM
Citation Zuo, YWang, XZhang, YWen, LWu, SYuan, X Quinolinone compound and use thereof US Patent US10065928 Publication Date 9/4/2018
 
Hypoxia-inducible factor 1-alpha
Name:Hypoxia-inducible factor 1-alpha
Type:Protein
Mol. Mass.:92647.24
Organism:Homo sapiens (Human)
Description:Q16665
Residue:826
BDBM271481
NameBDBM271481
Synonyms:2-(7-(2-chloro-4-fluorophenoxy)-4-hydroxy-1-methyl-2-oxo-1,2-dihydroquinoline-3-carboxamido)acetic acid | US10065928, Example 28
TypeSmall organic molecule
Emp. Form.C19H14ClFN2O6
Mol. Mass.420.776
SMILESCn1c2cc(Oc3ccc(F)cc3Cl)ccc2c(O)c(C(=O)NCC(O)=O)c1=O